Microsoft sql native client description login failed työt

Suodata

Viimeisimmät hakuni
Suodatusperuste:
Budjetti
asti
asti
asti
Tyyppi
Taidot
Kielet
    Työn tila
    443 microsoft sql native client description login failed työtä löytyi, hinnoittelu EUR

    ...to them. We are seeking a company to finalise what they cannot. We have given them ample opportunity and they have failed miserably. It is not a complex app and a first version was completed but needed many improvements. They failed to provided a successful working edition of the improved version. I can provide further details for those that might

    €615 (Avg Bid)
    €615 Keskimäär. tarjous
    50 tarjoukset

    Hello, I have a virtual machine windows, I install virtual dj but I have a problem with the sound card and direct X. Direct X failed to [kirjaudu nähdäksesi URL:n] install the correct driver for your video card Thank you

    €22 (Avg Bid)
    €22 Keskimäär. tarjous
    3 tarjoukset

    I have 15 log groups with multiple log streams. I can already retrieve information from 1 log group and multiple log streams using a filter pattern. What I want to do it automate this so that for the last week, I can execute a script that will retrieve 3 to 5 terms occurring in all the logs. We can use a for loop wrapper around the CloudWatch query.

    €195 (Avg Bid)
    €195 Keskimäär. tarjous
    7 tarjoukset

    When I try to access my WordPress admin url I get this php error: Re: {100-4264464} public_html/wp-admin/[kirjaudu nähdäksesi URL:n]): failed to open stream: No such file or directory in /home/lionscreativeweb/public_html/wp-admin/[kirjaudu nähdäksesi URL:n] on line 17 Fix any other errors. $10 to $20 max.

    €17 (Avg Bid)
    €17 Keskimäär. tarjous
    43 tarjoukset

    ...Photo-viewer plugin, cannot build android version with Ionic project. Here's error log. $ ionic cordova build --release android ... BUILD FAILED in 12s 27 actionable tasks: 27 executed /.../platforms/android/gradlew: Command failed with exit code 1 Error output: Note: Some input files use or override a deprecated API. Note: Recompile with -Xlint:deprecation for

    €31 (Avg Bid)
    €31 Keskimäär. tarjous
    12 tarjoukset

    Please watch the following video. My translation file is full from Vietnamese to Japanese. But when clicking on the "edit information" link or other links below, you will be jumping back to the Vietnamese page. I want to go to Japanese page if I am in Japanese page. The translation file has already translated all but it doesn't show up but goes back to the Vietnamese page.

    €22 (Avg Bid)
    €22 Keskimäär. tarjous
    3 tarjoukset

    After the latest Wordpress update we are not able to update pages, it always says "Failed to update". Also, need help with the Google Maps API Key.

    €23 (Avg Bid)
    €23 Keskimäär. tarjous
    25 tarjoukset

    Mail delivery message failed error We are getting mailed delivery message failed when customer place there orders. Customers are not getting email confirmation this was working fine before however since change to vps dedicated server no email confirmation being received. This can be quick fix but not sure where to look. Thanks

    €21 (Avg Bid)
    €21 Keskimäär. tarjous
    26 tarjoukset
    €26 Keskimäär. tarjous
    16 tarjoukset

    the MySQL service has issues it keeps crashing on start and corrupting tables when restarted in repair mode it works, but as soon as repair mode is removed, and MySQL starts again, it crashes again

    €11 / hr (Avg Bid)
    €11 / hr Keskimäär. tarjous
    18 tarjoukset

    ...long time and for 5 out of 7 pages on the server php is working normally. But with 2 pages i have the following problem : FastCGI: failed to connect to server "/var/www/php-fpm/name/[kirjaudu nähdäksesi URL:n]": connect() failed FastCGI: incomplete headers (0 bytes) received from server "/var/www/php-fpm/name/[kirjaudu nähdäksesi URL:n]" L...

    €28 (Avg Bid)
    €28 Keskimäär. tarjous
    15 tarjoukset

    i need how to get 503 instead of any other failure code change it all to 503

    €20 (Avg Bid)
    €20 Keskimäär. tarjous
    4 tarjoukset

    captcha will stop working if captcha is validated on the form but the validation of the form is triggered after the captcha validation is done.

    €20 (Avg Bid)
    €20 Keskimäär. tarjous
    24 tarjoukset

    ...ipdb> [kirjaudu nähdäksesi URL:n]([kirjaudu nähdäksesi URL:n]([kirjaudu nähdäksesi URL:n][0], -1)) *** [kirjaudu nähdäksesi URL:n]: Failed in nopython mode pipeline (step: nopython frontend) Invalid use of type(CPUDispatcher(<function rdist at 0x7f36c7ce...

    €102 (Avg Bid)
    €102 Keskimäär. tarjous
    8 tarjoukset

    good day I have a new magento 2 webshop that did not want to mail I have tried this This module works only with Magento 2.2.4/2.2.5 versions and need to be removed after upgrade/downgrade. Assumed that the issue will be fixed in the new release. 1. How to install module Install via composer Run the following command in Magento 2 root folder: composer require sashas/bug-from-email php bin/mage...

    €180 (Avg Bid)
    €180 Keskimäär. tarjous
    13 tarjoukset

    trying to upload productos to magento and i cant because i got this error after 70 seconds. ************ Error 503 Backend fetch failed Backend fetch failed Guru Meditation: XID: 1999504 Varnish cache server ******** also need to be checked timeout limits

    €19 (Avg Bid)
    €19 Keskimäär. tarjous
    15 tarjoukset

    Magento Cron script readiness check failed

    €23 (Avg Bid)
    €23 Keskimäär. tarjous
    15 tarjoukset

    I need node js and MongoDB on the amazon ec2. I have installed the node js and MongoDB. But Because of some reason, MongoDB is not able to connect. I need help from MongoDB admin who can help me in configuring MongoDB on aws ec2 instance. Please bid Only, if you are comfortable in working on a shared screen. I won't be able to give aws credential to you.

    €23 (Avg Bid)
    €23 Keskimäär. tarjous
    3 tarjoukset

    The application is failing cert verification for custom CA signed vcertificates

    €11 (Avg Bid)
    €11 Keskimäär. tarjous
    1 tarjoukset

    Hallo, My name is Alex. I have two small projects that I have built in Rhino and Houdini to 3D print. However, I am having trouble completing the project due to Booleans failing (crossed boundaries / unshared edges) Do you have some experience in Houdini? I will need these issues resolved ready for printing. I will also have more projects coming up so it would be good to find someone to work with....

    €19 / hr (Avg Bid)
    €19 / hr Keskimäär. tarjous
    10 tarjoukset

    I am using mac osx high sierra. I get this error when i start a app "Creation failed: Unable to find Chrome executable" searchcode: [kirjaudu nähdäksesi URL:n] Thank you.

    €24 (Avg Bid)
    €24 Keskimäär. tarjous
    2 tarjoukset

    C# project error Precondition Failed error on HTTP request Please bid if you know the problem : Max budget 15$

    €18 (Avg Bid)
    €18 Keskimäär. tarjous
    5 tarjoukset

    Hello, We have an application which connects to our websites mariadb for exchanging license information. But from few days we are getting above mentioned error. So we need to solve this quickly and urgently. So I have attached source file where error is occurs and if you need to debug whole source code then it can be done through teamviewer on my pc. Thank you.

    €2 / hr (Avg Bid)
    €2 / hr Keskimäär. tarjous
    1 tarjoukset

    Hello, When moving from one hosting to an other, my gallery2 script has been moved but don't work. I need help to fix this. Only apply if you know gallery2 script : [kirjaudu nähdäksesi URL:n] Tx

    €32 (Avg Bid)
    €32 Keskimäär. tarjous
    17 tarjoukset

    It's failed to upload the image in the post as attached. Reminder: The uploaded file could not be moved to wp-content/uploads/2018/09. The folder writing is 755. It's okay to upload the image if I set the folder as 777.

    €20 (Avg Bid)
    €20 Keskimäär. tarjous
    37 tarjoukset

    https:/...com/store/apps/details?id=[kirjaudu nähdäksesi URL:n] [kirjaudu nähdäksesi URL:n] The apps above (same platform) are getting the "handshake failed" error for users of android 7.0. I need someone to fix this error for me on either the server or app side. I prefer a fix on the server side if possible.

    €155 (Avg Bid)
    €155 Keskimäär. tarjous
    18 tarjoukset

    we have a php mysql server running on the server and its used by our devices to send attendance data. When I use df command, the output says 61% disk is used but df -i shows 100% Inodes used. It shouldn't more than one hour job for someone who knows the stuff

    €107 (Avg Bid)
    €107 Keskimäär. tarjous
    7 tarjoukset

    From UI I would like to see an option for the user to select “re run failures”. If selected, when the original test set completes, we should automatically compile the test cases which were logged as FAIL, and automatically re-run FAIL test cases

    €219 (Avg Bid)
    €219 Keskimäär. tarjous
    5 tarjoukset

    After Restarting nginx (via systemctl): Job for [kirjaudu nähdäksesi URL:n] failed because the control process exited with error code. See "systemctl status [kirjaudu nähdäksesi URL:n]" and "jo urnalctl -xe" for details. Full written sinstractions how can we fix this issue in the future.

    €28 (Avg Bid)
    €28 Keskimäär. tarjous
    17 tarjoukset

    i have problem with my outlook. it seems very easy but i dont want make something wrong Failed to register VB Script DLL .. its says Reinstall or run Regsvr32,exe [kirjaudu nähdäksesi URL:n] to self register.

    €34 (Avg Bid)
    €34 Keskimäär. tarjous
    3 tarjoukset

    I have a website down, and it's spitting this error. PHP Fatal error: require(): Failed opening required '/home2/officeca/public_html/wp-includes/rest-api/endpoints/[kirjaudu nähdäksesi URL:n]' (include_path='.:/opt/alt/php70/usr/share/pear') in /home2/officeca/public_html/[kirjaudu nähdäksesi URL:n] on line 238 Thanks!

    €22 (Avg Bid)
    €22 Keskimäär. tarjous
    52 tarjoukset

    Good day freelancers, This is a super easy project for the right candidate. My GeForece Experience says that "A supported g...super easy project for the right candidate. My GeForece Experience says that "A supported game is required to use this feature" and the followed by "Your broadcast to twitch failed". I'm looking for someone to solve it for me.

    €4 / hr (Avg Bid)
    €4 / hr Keskimäär. tarjous
    6 tarjoukset

    We use bitbucket for repository. In the pipeline to deploy the code to another server, it reports the following error. It seems there's We need an expert in Laravel to help fix the issue. It seems we need to deploy project from scratch installing all dependencies? After this, we hope to establish long term collaborations. <1s + ssh -p 9222 -o BatchMode=yes -o StrictHostKeyChecking=...

    €32 (Avg Bid)
    €32 Keskimäär. tarjous
    27 tarjoukset

    ...project. I have a file that I am trying to run a CFD on through ANSYS that I need quite urgently, however when I try and mesh the file I get the error: "One or more entities failed to mesh. The mesh of the bodies containing these entities may not be up-to-date. However, meshing might be successful on the other entities". I only get this problems with

    €18 / hr (Avg Bid)
    €18 / hr Keskimäär. tarjous
    17 tarjoukset

    ...project. I have a file that I am trying to run a CFD on through ANSYS that I need quite urgently, however when I try and mesh the file I get the error: "One or more entities failed to mesh. The mesh of the bodies containing these entities may not be up-to-date. However, meshing might be successful on the other entities". I only get this problems with

    €89 (Avg Bid)
    €89 Keskimäär. tarjous
    30 tarjoukset

    Redirect folder "Can not create folder "ServerNameRedirected_User_FilesUserNameDesktop" Error details: "Access is denied. OS: Windows 7 x64

    €109 (Avg Bid)
    €109 Keskimäär. tarjous
    37 tarjoukset

    Hello, i uploads media file to uploads folder on FTP but i still dont see it in media libelary, in articl...range for example 2-3 month but i see i got some error - it sounds like timeout becouse i have a lot of images. Whatever now i try to import only one month but i got error: Failed to import Media and a large list. example XML file in attachment

    €35 (Avg Bid)
    Taattu
    €35
    5 työtä

    You can see the error here: [kirjaudu nähdäksesi URL:n] Site uses Yii, PHP and Mysql

    €22 (Avg Bid)
    €22 Keskimäär. tarjous
    10 tarjoukset

    import via plesk Job for [kirjaudu nähdäksesi URL:n] failed because the control process exited with error code. See "systemctl status [kirjaudu nähdäksesi URL:n]" and "journalctl -xe" for details. Unable to import the database_new dump: ERROR 1062 (23000) at line 12478: Duplicate entry 'i breeze 500 [0,127970,129113] -> [N] POST [kirjaudu n&a...

    €47 (Avg Bid)
    €47 Keskimäär. tarjous
    14 tarjoukset

    import via plesk Job for [kirjaudu nähdäksesi URL:n] failed because the control process exited with error code. See "systemctl status [kirjaudu nähdäksesi URL:n]" and "journalctl -xe" for details. Unable to import the database_new dump: ERROR 1062 (23000) at line 12478: Duplicate entry 'i breeze 500 [0,127970,129113] -> [N] POST [kirjaudu n&a...

    €26 (Avg Bid)
    €26 Keskimäär. tarjous
    4 tarjoukset

    [kirjaudu nähdäksesi URL:n] is getting a "secure connection failed" error for some browsers: see: [kirjaudu nähdäksesi URL:n]://[kirjaudu nähdäksesi URL:n] I need help to fix this issue.

    €86 (Avg Bid)
    €86 Keskimäär. tarjous
    40 tarjoukset

    Only need fixe for gradle 4.4 synchronization . and build apps complete show on ui . just fixed it . if you are experience on it it just less than 20 mins . thank you

    €18 / hr (Avg Bid)
    €18 / hr Keskimäär. tarjous
    11 tarjoukset

    Hey! Can someone help me with this error? I am not able to start my react-native app. Android studio shows this error: "Failed to resolve: react-native" If I start the react-native app with the console, the error "Execution failed for task ':app:processDebugResources'." appears.

    €5 / hr (Avg Bid)
    €5 / hr Keskimäär. tarjous
    20 tarjoukset

    Error: /project/gradlew: Command failed with exit code 1 Error output: FAILURE: Build failed with an exception. A problem occurred configuring root project 'project'. Here is the exact error: Could not find [kirjaudu nähdäksesi URL:n] ([kirjaudu nähdäksesi URL:n]:play-services-auth-base-license:11.8.0). Searched in the following locations with

    €14 / hr (Avg Bid)
    €14 / hr Keskimäär. tarjous
    5 tarjoukset

    I need someone to configure my email server. It must be very simple but I do not know how to do it. Currently I get this error "550-No Such User Here 550 Sender verify failed" When I send an email from my server to hotmail, it bounces me; when I send to another domain I also reboot it, and gmail receives it but fails to identify the sender. And from

    €23 (Avg Bid)
    €23 Keskimäär. tarjous
    8 tarjoukset

    here's the error - I need you to fox this. I would but I do not have time - this is no more than 1 hour - do not bid if you think it will take more time because if you do you're unqualified to do the work. What would you like to do? ------------------------------------------------------------------------------- 1: Attempt to reinstall this existing certificate 2: Renew & replace the ...

    €23 (Avg Bid)
    €23 Keskimäär. tarjous
    6 tarjoukset

    I have attached a detail document here. It's a simple game work. I worked this with an indian team. But they were full of cheaters. He took my money and gave so bad works. I dont' want to fail again. He still not feeling about their fault at all. So I want you guys to make a bad review on their company first. Then I will be able to discuss with you project. Don't regard my price her...

    €947 (Avg Bid)
    €947 Keskimäär. tarjous
    27 tarjoukset

    ...paid-then the site name that is freelancer, so in your test if your name is Moses save it this way. Moses_$8_Freelancer (this is part of the test so dont ignore) If you applied and failed please dont apply again. We only want serious people for long term cooperation, and please dont repost our post we will report you. And also we dont want our work to be seen

    €23 (Avg Bid)
    €23 Keskimäär. tarjous
    8 tarjoukset

    I am looking for advanced proofreaders who can also track changes, I have attached an example and also the test in the file section below. Our rates are strictly 8-12$ per 1000 words. Please send your saved test results in the format eg. moffat_12$_freelancer. Meaning name_your rate in USD_platform. Kindly bid if you are serious, find the attached test do it and send. Start with the word "fin...

    €10 / hr (Avg Bid)
    €10 / hr Keskimäär. tarjous
    21 tarjoukset

    After noting that divorce rate in America is almost 40% i decided to write a kindle book and publish it on Amazon. I am a third year psychology student so I have some advice to add to this book and I also have specific books to cite ( e.g evolutionary psychology)

    €44 (Avg Bid)
    €44 Keskimäär. tarjous
    12 tarjoukset